OpenViBE forum

The OpenViBE community
It is currently Thu Dec 14, 2017 10:12 am

All times are UTC




Post new topic Reply to topic  [ 3 posts ] 
Author Message
 Post subject: Error building on VS2010
PostPosted: Fri Jan 29, 2016 11:18 am 
Offline

Joined: Fri Jan 29, 2016 10:21 am
Posts: 2
Hello,

I new to Open Vibe and I'm trying to build the source code con win 7 (32bit) machine because a have to develop a new driver.
I followed the build guideline on the website. Everything was fine until starting the build process.
I build the INSTALL project and at the end I will get the following error:

Code:
56>  CMake Error at applications/examples/external-stimulation-connection/cmake_install.cmake:40 (FILE):
56>    file INSTALL cannot find
56>    "C:/Users/riente/Documents/openvibe-1.1.0-src/openvibe-1.1.0-src/local-tmp/visual/applications/examples/external-stimulation-connection/Debug/openvibe-external-stimulation-connection-example.exe".
56>  Call Stack (most recent call first):
56>    applications/examples/cmake_install.cmake:33 (INCLUDE)
56>    applications/cmake_install.cmake:34 (INCLUDE)
56>    cmake_install.cmake:50 (INCLUDE)
56> 
56> 
56>C:\Program Files\MSBuild\Microsoft.Cpp\v4.0\Microsoft.CppCommon.targets(113,5): error MSB3073: The command "setlocal
56>C:\Program Files\MSBuild\Microsoft.Cpp\v4.0\Microsoft.CppCommon.targets(113,5): error MSB3073: ..\..\dependencies\cmake\bin\cmake.exe -DBUILD_TYPE=Debug -P cmake_install.cmake
56>C:\Program Files\MSBuild\Microsoft.Cpp\v4.0\Microsoft.CppCommon.targets(113,5): error MSB3073: if %errorlevel% neq 0 goto :cmEnd
56>C:\Program Files\MSBuild\Microsoft.Cpp\v4.0\Microsoft.CppCommon.targets(113,5): error MSB3073: :cmEnd
56>C:\Program Files\MSBuild\Microsoft.Cpp\v4.0\Microsoft.CppCommon.targets(113,5): error MSB3073: endlocal & call :cmErrorLevel %errorlevel% & goto :cmDone
56>C:\Program Files\MSBuild\Microsoft.Cpp\v4.0\Microsoft.CppCommon.targets(113,5): error MSB3073: :cmErrorLevel
56>C:\Program Files\MSBuild\Microsoft.Cpp\v4.0\Microsoft.CppCommon.targets(113,5): error MSB3073: exit /b %1
56>C:\Program Files\MSBuild\Microsoft.Cpp\v4.0\Microsoft.CppCommon.targets(113,5): error MSB3073: :cmDone
56>C:\Program Files\MSBuild\Microsoft.Cpp\v4.0\Microsoft.CppCommon.targets(113,5): error MSB3073: if %errorlevel% neq 0 goto :VCEnd
56>C:\Program Files\MSBuild\Microsoft.Cpp\v4.0\Microsoft.CppCommon.targets(113,5): error MSB3073: :VCEnd" exited with code 1.
========== Rebuild All: 53 succeeded, 3 failed, 0 skipped ==========


Thanks in advance.


Top
 Profile  
Reply with quote  
PostPosted: Tue Feb 02, 2016 9:06 am 
Offline

Joined: Tue Dec 04, 2012 3:53 pm
Posts: 599
Location: INRIA Rennes, FRANCE
Hello,

is the file there that its trying to find? The only thing I can think of is that your path is very long, and gives Windows some trouble. Try to put the source code closer to the C:\ root.


Cheers,
Jussi


Top
 Profile  
Reply with quote  
PostPosted: Fri Feb 05, 2016 1:57 pm 
Offline

Joined: Fri Jan 29, 2016 10:21 am
Posts: 2
It works! I put the source code in C:/

thanks a lot for the suggestion! :D


Top
 Profile  
Reply with quote  
Display posts from previous:  Sort by  
Post new topic Reply to topic  [ 3 posts ] 

All times are UTC


Who is online

Users browsing this forum: No registered users and 1 guest


You cannot post new topics in this forum
You cannot reply to topics in this forum
You cannot edit your posts in this forum
You cannot delete your posts in this forum
You cannot post attachments in this forum

Search for:
Jump to:  
Powered by phpBB® Forum Software © phpBB Group
Americanized by Maƫl Soucaze.