OpenViBE forum

The OpenViBE community
It is currently Fri Dec 15, 2017 9:38 pm

All times are UTC




Post new topic Reply to topic  [ 7 posts ] 
Author Message
PostPosted: Thu Dec 18, 2014 10:03 am 
Offline

Joined: Wed Dec 03, 2014 3:58 pm
Posts: 10
Hi

DISCLAIMER: I know less than nothing about c or c++

I am getting the error listed below when building (git source), and from googling I suspect that the links listed has the answer but it is beyond my skill set to fix it seams, could some one please assist me?

http://stackoverflow.com/questions/2033 ... or-message
http://fedoraproject.org/wiki/Understan ... LinkChange


Linking CXX executable test_evidenceaccumulation
CMakeFiles/test_evidenceaccumulation.dir/__/__/src/tagging/ovexCSoftTagger.cpp.o: In function `boost::interprocess::shared_memory_object::remove(char const*)':
/usr/include/boost/interprocess/shared_memory_object.hpp:382: undefined reference to `shm_unlink'
/usr/include/boost/interprocess/shared_memory_object.hpp:382: undefined reference to `shm_unlink'
/usr/include/boost/interprocess/shared_memory_object.hpp:382: undefined reference to `shm_unlink'
CMakeFiles/test_evidenceaccumulation.dir/__/__/src/tagging/ovexCSoftTagger.cpp.o: In function `boost::interprocess::shared_memory_object::priv_open_or_create(boost::interprocess::ipcdetail::create_enum_t, char const*, boost::interprocess::mode_t, boost::interprocess::permissions const&)':
/usr/include/boost/interprocess/shared_memory_object.hpp:315: undefined reference to `shm_open'
CMakeFiles/test_evidenceaccumulation.dir/__/__/src/tagging/ovexCSoftTagger.cpp.o: In function `boost::interprocess::shared_memory_object::remove(char const*)':
/usr/include/boost/interprocess/shared_memory_object.hpp:382: undefined reference to `shm_unlink'
CMakeFiles/test_evidenceaccumulation.dir/__/__/src/tagging/ovexCSoftTagger.cpp.o: In function `boost::interprocess::shared_memory_object::priv_open_or_create(boost::interprocess::ipcdetail::create_enum_t, char const*, boost::interprocess::mode_t, boost::interprocess::permissions const&)':
/usr/include/boost/interprocess/shared_memory_object.hpp:309: undefined reference to `shm_open'
/usr/include/boost/interprocess/shared_memory_object.hpp:309: undefined reference to `shm_open'
/usr/include/boost/interprocess/shared_memory_object.hpp:315: undefined reference to `shm_open'
/usr/include/boost/interprocess/shared_memory_object.hpp:309: undefined reference to `shm_open'
/usr/include/boost/interprocess/shared_memory_object.hpp:309: undefined reference to `shm_open'
CMakeFiles/test_evidenceaccumulation.dir/__/__/src/iocommunication/ovexISharedMemoryReader.cpp.o: In function `boost::interprocess::shared_memory_object::remove(char const*)':
/usr/include/boost/interprocess/shared_memory_object.hpp:382: undefined reference to `shm_unlink'
CMakeFiles/test_evidenceaccumulation.dir/__/__/src/iocommunication/ovexISharedMemoryReader.cpp.o: In function `boost::interprocess::shared_memory_object::priv_open_or_create(boost::interprocess::ipcdetail::create_enum_t, char const*, boost::interprocess::mode_t, boost::interprocess::permissions const&)':
/usr/include/boost/interprocess/shared_memory_object.hpp:334: undefined reference to `shm_open'
/usr/include/boost/interprocess/shared_memory_object.hpp:327: undefined reference to `shm_open'
/usr/include/boost/interprocess/shared_memory_object.hpp:309: undefined reference to `shm_open'
/usr/include/boost/interprocess/shared_memory_object.hpp:315: undefined reference to `shm_open'
collect2: error: ld returned 1 exit status
contrib/applications/platform/P300Stimulator/test/test_evidenceAccumulation/CMakeFiles/test_evidenceaccumulation.dir/build.make:1061: recipe for target 'contrib/applications/platform/P300Stimulator/test/test_evidenceAccumulation/test_evidenceaccumulation' failed
make[2]: *** [contrib/applications/platform/P300Stimulator/test/test_evidenceAccumulation/test_evidenceaccumulation] Error 1
CMakeFiles/Makefile2:3092: recipe for target 'contrib/applications/platform/P300Stimulator/test/test_evidenceAccumulation/CMakeFiles/test_evidenceaccumulation.dir/all' failed
make[1]: *** [contrib/applications/platform/P300Stimulator/test/test_evidenceAccumulation/CMakeFiles/test_evidenceaccumulation.dir/all] Error 2
Makefile:113: recipe for target 'all' failed
make: *** [all] Error 2


Top
 Profile  
Reply with quote  
PostPosted: Mon Jan 05, 2015 9:05 am 
Offline

Joined: Tue Dec 04, 2012 3:53 pm
Posts: 601
Location: INRIA Rennes, FRANCE
This likely corresponds to a reported bug,

http://openvibe.inria.fr/tracker/view.php?id=165

We are working on it.


Best,
Jussi


Top
 Profile  
Reply with quote  
PostPosted: Mon Jan 12, 2015 12:45 pm 
Offline

Joined: Wed Dec 03, 2014 3:58 pm
Posts: 10
9 mg sotitl/r/>Let , even mg nd my ju:
Thanx it looks that way, I will keep an eye on the tracker issue.

Let me/>Let
Top
 Profile  
80
 Post subject: Re: Bu80
PostPosted: Mon Jan 12, 2015 12:45 pm 7/div>
Offline

Joined: Tue Dec 04, 2012 3:53 pm
Posts: 601
Location: INRIA Rennes, FRANCE
Hi

Let me/>Leumberro"10m/dione p 9 beams,e> &# ), ama ,to go one ptr" /> 'alo g. />
Best,


Top
 Profile  
84
 Post subject: Re: Bu84
PostPosted: Mon Jan 12, 2015 12645 pm&n8:56/div>
Offline

Joined: Tue Dec 04, 2014 3:58 pm
Posts: 10
Thanx it lr />DISCLAIMERIts++DISCLAIMERRegardtrib/apPhil

Top
 Profile  
Reply with quote  
86
 Post subject: Re: Bu86
PostPosted: Mon Jan 12, 2015 12945 pm&nb0:unddiv>
Offline

Joined: Tue Dec 04, 2014 3:58 pm
Posts: 10
Thanx it lSoinela it.s w="5 fan eyI ad */ temporal
Besty coris listed beli see &# r iss connal:/>
Bestinria.fr//on" /bininria.fr/-des eo: symbolt wayup returne/hod)/phil/D »inria.fr//on" /lib/x86_64-td>ux-gnu/libnria.fr/-plugins-plicati-s al-ared_mede=qsod reference symbol: _ZN4itpp5zerosE />DISCLAIMERSione pI m_t, c


Top
 Profile  
Reply with quote  

OpenViss="spacer" cotableBuild on Us="gen">The Opend> 2 week hrotent=eThe Opend> timutr>

Post new topic Reply to topic  [ 7 posts ] 
foopenViB clear="all" />

All times are UTC



Whoris o/>CM h4>r> class="row1">

pend> r>


c00%" heig4acinp" class="prowrap"> ft" valign="m r> Us="gen">The Opend> cannotof &ns &# r is> cannotof s &# r is> cannotof cannotof cannotof able>

0 c0eThe Opend> < foreadcrumbhref"p/javascripst79"> middlue=" sfmiddlue="msgo/>yk reld foreicatiohraphttp> sidmiddlue="c606243da66b1b0a1f1975">timutr> vabox"pics 0 ng="0" style="marborder Us="gen">The Opend> ref="./=eor: 979"> otent=e s= s=="otent=iddlue="5"bsp; otent=e s= s=="otent=iddlue="17"bsp; » otent=e s= s=="otent=iddlue="4"rgeor: etenseor: ets sp;sp;
timut tr> able>
Help for height="1" /> < to tcstr= reld> id="wrapcentre"> foopenViss="s="gen">The Ocopyrap="n by./viewforunvibs://ww65

© > by./viewforunvib://ww65maelsoucazeions/">MaĆ«l S>ucaze div>